{"text_format":"1","workbook":"xlsx","n_sheets":9,"sheets":["Invulinstructie ","Totaalblad","Overzicht gemeenten","Versiebeheer","begin","Gemeente x","einde","Productcodes","sheet_name_check"],"not_rendered":{"charts":0,"images":1,"macros":1,"external_links":1,"defined_names":9,"comments":0,"pivot_tables":0},"unopened":[],"bounds":{"document_bytes":16777216,"sheet_cells":100000,"rows_first":2000,"rows_last":500,"rows_between":2000,"halvings":0,"cell_chars":16384,"cell_head_chars":4096},"cells_cut":0,"cells_raw":0,"read":"whole","date_system":"1900"}

{"sheet":"Invulinstructie ","index":0,"n_rows":3,"n_cols":2,"rows_kept":3,"cut":false,"hidden":false,"merged":[[2,1,165,9]]}
[null,"Invulinstructie Financiële productieverantwoording Jeugdwet"]
[]
[null,"JEUGDWET INVULINSTRUCTIE \n\nAlgemeen\nDit formulier is bedoeld voor de financiële verantwoording van zorgaanbieders uit hoofde van de Jeugdwet. De financiële productieverantwoording bevat de definitieve opgave van de gerealiseerde productie 2017 en is onlosmakelijk verbonden aan het “Algemeen accountantsprotocol financiële productieverantwoording WMO en Jeugdwet 2017”. Zie verder het “Algemeen accountantsprotocol financiële productieverantwoording WMO en Jeugdwet 2017”  (http://i-sociaaldomein.nl/).\n\nVoor zover in dit formulier wordt gesproken over ‘zorgaanbieder’ wordt hiermee bedoeld: alle onderdelen van een beherend rechtspersoon die samen opgenomen zijn in het gesloten contract met betreffende gemeente(n). Voor de definitie van 'gemeente' zie de definitielijst van het “Algemeen accountantsprotocol financiële productieverantwoording WMO en Jeugdwet 2017”. \n\nEen boekjaar wordt gelijk gesteld aan het kalenderjaar. Wanneer sprake is van zorgtrajecten/ DBC’s die niet per einde van het boekjaar kunnen worden afgesloten, geldt dat de financiële productieverantwoording tevens de financiële waarde van fictief afgesloten zorgtrajecten/ DBC's omvat die per 31 december 2017 onderhanden zijn. \nWe wijzen u erop dat met ingang van 2018 gemeenten geen specialistische Jeugd-ggz kunnen contracteren en bekostigen op basis van de DBC-systematiek. Dit betekent dat op 31 december 2017 alle DBC’s die onder de Jeugdwet vallen, worden beëindigd. Voor de productieverantwoording betekent dit concreet dat er in principe geen sprake meer kan zijn van Onderhanden Werk ultimo 2017, omdat alle DBC’s worden beëindigd. Voor meer informatie over deze ‘harde afsluiting’ verwijzen wij u naar het ‘Protocol beëindiging DBC-bekostigingssystematiek jeugd-ggz en JW321-bericht per 01 januari 2018’  (http://i-sociaaldomein.nl/publicaties/protocol-beeindiging-dbc-systematiek-en-jw321-bericht).    \n\nHet formulier moet van voor naar achteren en van boven naar beneden worden ingevuld. Alle door u in te vullen velden zijn ‘blauw gearceerd’. Witte cellen geven uitkomsten van berekeningen weer. \n\nHieronder wordt, indien van toepassing, per tabblad een toelichting gegeven. \n\nTabblad ‘Totaalblad’\nHet tabblad ‘Totaalblad’ geeft de totaal gerealiseerde productie uit hoofde van de Jeugdwet weer, waarvan gemeenten een accountantscontrole voorschrijven. \n\nTabblad ‘Overzicht gemeenten’\nIn dit tabblad geeft u aan voor welke gemeente(n) u uw geleverde productie uit hoofde van de Jeugdwet wilt verantwoorden. Heeft u met een gemeente ook afspraken binnen het domein Wmo, dan gebruikt u daarvoor het verantwoordingsformat Wmo. In de financiële productieverantwoording op totaalniveau per domein wordt alleen de productie Jeugdwet verwerkt die betrekking heeft op de gemeenten die een accountantscontrole voorschrijven. De accountant waarmerkt dit overzicht en verwijst er naar in zijn controleverklaring (onderdeel “Overige aspecten – beperking in gebruik en verspreidingskring”). \n\nVoor het aanmaken van de verantwoordingen per gemeente, vult u in het bovenste blok op regelniveau de gemeente(n) in waar u verantwoording over af wilt leggen. Vervolgens klikt u op de button ‘Aanmaken verantwoordingen’. Het systeem maakt dan automatisch de tabbladen (voorzien van de naam van de gemeente) aan. Indien u meer regels nodig heeft, klikt u op ‘toevoegen’. Het systeem voegt een nieuwe regel toe onder de regel waar u staat met uw cursor. Dit maakt het mogelijk om ook tussen de reeds ingevoerde regels, nieuwe regels te plaatsen. Nadat u vervolgens de namen van de gemeente(n) heeft ingevuld, klikt u opnieuw op de button ‘Aanmaken verantwoordingen’. Het systeem voegt de nieuwe tabbladen voorzien van de naam van de gemeente toe. Heeft u per ongeluk een verkeerde gemeente opgenomen, dan kunt u deze verwijderen. Ga hiervoor op de betreffende regel staan en klik op de button ‘verwijderen’. Klik vervolgens opnieuw op de button ‘Aanmaken verantwoordingen’ om ook het bijbehorende tabblad te verwijderen.   \n \nNa het aanmaken van de tabbladen is het niet gewenst om de volgorde van de tabbladen te wijzigen. Indien u toch wijzigingen aanbrengt, kunnen er fouten optreden in de automatische tellingen.\n\nOp basis van de ingevulde financiële productieverantwoordingen per gemeente berekent het model in het tabblad ‘Totaalblad’ de totale gerealiseerde productie binnen het domein Jeugdwet. \n\nDoor ondertekening van het formulier ‘Financiële productieverantwoording 2017’ verklaart de bestuurder van de zorgaanbieder dat de financiële productieverantwoording 2017 naar waarheid en in overeenstemming met de vigerende wet- en regelgeving is verantwoord. Zie hiervoor paragraaf 3.5 Normen- en toetsingskader, “Algemeen accountantsprotocol financiële productieverantwoording WMO en Jeugdwet 2017”.\n\nTabblad ‘Versiebeheer’\nAls het formulier na publicatie nog is aangepast en er dus een nieuwe versie beschikbaar is, dan kunt u in het tabblad Versiebeheer zien welke mutaties er zijn doorgevoerd ten opzichte van het eerder gepubliceerde formulier. \n\nTabblad ‘Gemeente’ \nOvereenkomstig het aantal ingevulde ‘gemeenten’  worden standaard tabbladen aangemaakt. Per gemeente legt u achtereenvolgens verantwoording af over de gerealiseerde productie 2017 binnen het domein Jeugdwet. \n\nBinnen het formulier is zoveel mogelijk rekening gehouden met de variëteit in de wijze van het maken van inkoopafspraken, gehanteerde productgroepbenamingen (iJW2.1) en bekostigingssvormen door de gemeenten voor 2017. Hierdoor kan het voorkomen dat een deel van de velden voor u niet relevant is of dat u juist extra velden nodig heeft. Extra velden kunnen worden toegevoegd via de button 'toevoegen'.  Een teveel aan rijen kan worden verminderd via een klik op de button 'verwijderen'. Voor de consistentie van het formulier, verzoeken wij u, met uitzondering van de daarvoor bestemde buttons, geen cellen/ rijen/ kolommen te verwijderen. \n\nDiverse gemeenten hebben in 2015 contracten voor langere tijd (>1 jaar) afgesloten en gebruikten producten van 2015 ook nog in 2016 en 2017. Om deze reden zijn in dit verantwoordingsformat de categorieën 31 t/m 38 uit 2015 toegevoegd. De verantwoording die u invult, betreft vanzelfsprekend de productie over 2017.\n\nIndien het overeengekomen contract voorzien is van een inkoopordernummer dan kunt u dit nummer per bekostigingsstroom invullen.\n\n- In de eerste kolom worden de automatisch aangemaakte regelnummers weergegeven;\n- In de tweede kolom, onder de naam van de Productcategorie (bijvoorbeeld Persoonlijke verzorging) vult u de omschrijving van het product in;\n- In de kolom 'Code' vult u, indien aanwezig, de bijbehorende productcode in;\n- In de kolom Eenheid geeft u aan op basis van welke grootheid de gerealiseerde productieaantallen verantwoord worden. Dit kan zijn minuten,  uren, dagdelen, etmalen, cliënten, trajecten, etc. ;\n- In de kolom 'Aantal' vult u het gerealiseerde aantal in, de Q; \n- In de kolom 'Prijs' vult u het overeengekomen tarief in, de P; \n- In de kolom 'Realisatie' berekent het formulier de gerealiseerde productie middels P*Q; \n- De laatste regel van een blok geeft de totaal gerealiseerde productie per Productcategorie weer; \n\nIn onderdeel 51 en 52 verantwoordt u de DBC productie over 2017. Deze productie is het saldo van onderstaande componenten: \n- Afgesloten DBC's\n- Af: Onderhanden werk per 1/1 \n- Bij: Onderhanden werk per 31/12 \nBij de productieverantwoording gaat het om geleverde zorg en niet de kasstromen (zoals bevoorschotting of tussentijdse facturatie). Afgesloten DBC’s worden opgenomen in het format onder regel 51a (Generalistische basis GGZ) of 52a (Specialistische GGZ). Of al dan niet is gefactureerd is niet relevant. \nNiet afgesloten DBC’s (OnderHandenWerk) worden opgenomen in het format onder regel 51b (Generalistische basis GGZ) of 52b (Specialistische GGZ). De waardering van het OHW wordt bepaald door een inschatting te maken op welke DBC’s de productie gaat eindigen en vervolgens door het aandeel voor 2017 op basis van de gemiddelde prijs te bepalen (fictief afsluiten op 31 december). \nVoor de volledigheid wijzen wij u er nogmaals op dat met ingang van 2018 gemeenten geen specialistische Jeugd-ggz kunnen contracteren en bekostigen op basis van de DBC-systematiek. Dit betekent dat op 31 december 2017 alle DBC’s die onder de Jeugdwet vallen worden beëindigd. Voor de productieverantwoording betekent dit concreet dat er in principe geen sprake meer kan zijn van Onderhanden Werk ultimo 2017, omdat alle DBC’s worde beëindigd. Voor meer informatie over deze ‘harde afsluiting’ verwijzen wij u naar het ‘Protocol beëindiging DBC-bekostigingssystematiek jeugd-ggz en JW321-bericht per 01 januari 2018’  (http://i-sociaaldomein.nl/publicaties/protocol-beeindiging-dbc-systematiek-en-jw321-bericht).    \n\nVoor meer informatie over de waardering van het onderhanden werk wordt verwezen naar \"Bijlage IV Definities en toelichting van gehanteerde begrippen\" van het “Algemeen accountantsprotocol financiële productieverantwoording WMO en Jeugdwet 2017”. \n\nIn onderdeel 54 vermeldt u producten of arrangementen die niet bekostigd zijn op basis van een input- of outputfinanciering (P*Q).  Hierbij kunt u denken aan bekostigingsvormen als taakgerichte productieafspraken, subsidiabele kosten, lumpsumbekostiging of overige specifieke bekostigingsvormen. Ook kunt u hier de maatwerkarrangementen kwijt die in Profielen (in het tabblad Productcodes te herkennen aan de codes die beginnen met een (‘P’) worden weergegeven. Verder biedt dit onderdeel tevens de mogelijkheid om correcties weer te geven. Hierbij kunt u bijvoorbeeld denken aan correcties uit voorgaande jaren n.a.v. een accountantscontrole. De regel correcties is niet bedoeld om gerealiseerde overproductie of doelmatigheidscorrecties weer te geven. \n\nIn de onderdelen 55, 56 en 57 verantwoordt u de productie die u leverde op basis van afspraken vanuit het Landelijk Transitie Arrangement. Het LTA beschrijft de afspraken tussen alle gemeenten en de zorgaanbieders die (mogelijk) in aanmerking komen voor landelijke afspraken voor specialistische functies. Producten die hieronder vallen, zijn onderaan opgenomen en 'geel gearceerd' in het tabblad Productcodes en zijn te herkennen aan de codes die beginnen met een ‘L’.  \n\nIndien u gebruik maakt van de Toelichtingsblokken, verzoeken wij u, indien mogelijk, te verwijzen naar het betreffende regelnummer. \n\nTabblad ‘Productcodes’\nHanteert de gemeente waar u zorg levert de landelijke standaardproductcodes conform iJW2.1, dan kunt u gebruik maken van het tabblad Productcodes. Hierin is de Standaardproductcodelijst opgenomen conform de landelijke I-standaarden (https://www.istandaarden.nl/istandaarden/ijw/werken-met-ijw-21/tabellen). Door de beveiliging van de werkbladen is het niet mogelijk om de standaardproductcodes te knippen en te plakken. Om de omschrijvingen en codes te verwerken in het verantwoordingsformat typt u in het gewenste veld in het tabblad van de gemeente waarover u verantwoordt \"=\",  vervolgens gaat u naar het tabblad \"Productcodes\" en kiest u het gewenste/geleverde product en drukt u tot slot op Enter.\n\nDeze uitgave is met grote zorgvuldigheid en met gebruikmaking van de meest actuele gegevens tot stand gekomen. Het is evenwel niet geheel uitgesloten dat de informatie in deze uitgave onjuistheden en/of onvolkomenheden bevat. AAG aanvaardt geen aansprakelijkheid voor directe of indirecte schade ontstaan door eventuele onjuistheden en/of onvolkomenheden. Aan de inhoud van deze uitgave kunnen geen rechten worden ontleend."]

{"sheet":"Totaalblad","index":1,"n_rows":48,"n_cols":14,"rows_kept":48,"cut":false,"hidden":false,"merged":[[31,10,40,14],[30,10,30,14],[19,5,19,7],[11,1,11,2],[11,3,11,8],[40,1,40,8],[31,1,39,8],[28,1,28,16],[27,1,27,4],[23,1,23,10],[25,1,26,14],[21,5,21,7],[20,5,20,7],[22,1,22,10],[20,3,20,4],[10,3,10,8],[20,1,20,2],[9,1,9,2],[8,4,8,8],[7,3,7,8],[7,1,7,2],[8,1,8,2],[10,1,10,2],[0,11,0,12],[0,9,0,10],[5,1,5,2],[9,3,9,8],[4,10,4,14],[5,13,5,14],[6,1,6,2],[5,3,5,8],[6,3,6,8]]}
[null,"Financiële productieverantwoording Jeugdwet op totaalniveau",null,null,null,null,null,null,null,2017]
[]
[null,"Zorgaanbieder "]
[]
[null,"Zorgaanbieder",null,null,null,null,null,null,null,null,"Versiebeheer"]
[null,"Naam",null,null,null,null,null,null,null,null,"Versiedatum",null,null,{"$f":"LOOKUP(9.99999999999999E+307,Versiebeheer!B:B)","v":"2017-09-04"}]
[null,"Plaats"]
[null,"KvK-nummer"]
[null,"Contactpersoon"]
[null,"Telefoon"]
[null,"E-mail"]
[null,"AGB-code"]
[]
[]
[]
[]
[]
[]
[]
[null,"Financieringsstroom",null,null,null,"Gerealiseerde productie 2017"]
[null,"Jeugdwet",null,null,null,{"$f":"SUM(begin:einde!R2)","v":0}]
[null,"TOTAAL gerealiseerde productie ",null,null,null,{"$f":"F21","v":0}]
[]
[]
[null,"Door ondertekening van het formulier 'Financiële productieverantwoording 2017':"]
[null,"Verklaart de bestuurder van de zorgaanbieder dat de financiële productieverantwoording Jeugdwet 2017 naar waarheid en in overeenstemming met het normenkader (zie paragraaf 3.5 Normen- en toetsingskader, Algemeen Accountantsprotocol 2017 Financiële productieverantwoording Wmo en Jeugdwet) is verantwoord."]
[]
[]
[]
[]
[null,"Zorgaanbieder",null,null,null,null,null,null,null,null,"Waarmerking Accountant voor identificatiedoeleinden:"]
[null,"(Naam & handtekening)",null,null,null,null,null,null,null,null,"behorend bij verklaring afgegeven d.d.:"]
[]
[]
[]
[]
[]
[]
[]
[]
[null,"Datum:"]
[]
[]
[]
[]
[]
[]
[null,"  "]

{"sheet":"Overzicht gemeenten","index":2,"n_rows":44,"n_cols":14,"rows_kept":44,"cut":false,"hidden":false,"merged":[[34,10,43,14],[25,2,25,9],[33,10,33,14],[23,2,23,9],[15,2,15,9],[16,2,16,9],[22,2,22,9],[21,2,21,9],[17,2,17,9],[18,2,18,9],[19,2,19,9],[20,2,20,9],[10,2,10,9],[14,2,14,9],[13,2,13,9],[12,2,12,9],[9,2,9,9],[11,2,11,9]]}
[null,"Overzicht gemeenten waarop financiële productieverantwoording Jeugdwet op totaalniveau betrekking heeft"]
[]
[]
[]
[]
[]
[]
[]
[null,0,"Gemeente(n)"]
[null,1]
[null,2]
[null,3]
[null,4]
[null,5]
[null,6]
[null,7]
[null,8]
[null,9]
[null,10]
[null,11]
[null,12]
[null,13]
[null,14]
[null,15]
[null,500,null,null,null,null,null,null,null,null,null,null,null,"hide row"]
[null,null,null,null,null,null,null,null,null,null,null,null,null,"hide row"]
[]
[]
[]
[]
[]
[]
[]
[null,"Zorgaanbieder",null,null,null,null,null,null,null,null,"Waarmerking Accountant voor identificatiedoeleinden:"]
[null,"(Naam & handtekening)",null,null,null,null,null,null,null,null,"behorend bij verklaring afgegeven d.d.:"]
[]
[]
[]
[]
[]
[]
[]
[]
[null,"Datum:"]

{"sheet":"Versiebeheer","index":3,"n_rows":11,"n_cols":6,"rows_kept":11,"cut":false,"hidden":false,"merged":[]}
[]
[null,"Versiebeheer"]
[]
[null,"In onderstaande tabel ziet u welke mutaties er zijn ten opzichte van eerdere versies van het formulier Financiële productieverantwoording 20XX"]
[null,"Hiermee kunt u bepalen of de gedane aanpassingen voor u van belang zijn. "]
[]
[null,"De eerste versie van het formulier is van:",null,null,{"$f":"B11","v":"2017-09-04"}]
[null,"De huidige versie van het formulier is van:",null,null,{"$f":"MAX(B11:B20)","v":"2017-09-04"}]
[]
[null,"Versie","Werkblad","Regel(s)","Foutmelding","Aanpassing"]
[null,"2017-09-04",null,null,null,"Eerste versie."]

{"sheet":"begin","index":4,"n_rows":0,"n_cols":0,"rows_kept":0,"cut":false,"hidden":true,"merged":[]}

{"sheet":"Gemeente x","index":5,"n_rows":255,"n_cols":18,"rows_kept":255,"cut":false,"hidden":true,"merged":[[217,2,217,9],[218,2,218,9],[219,2,219,9],[0,8,1,10],[169,2,169,9],[168,2,168,9],[165,2,165,9],[166,2,166,9],[89,2,89,5],[11,3,11,6],[122,2,122,5],[82,2,82,5],[18,3,18,5],[7,8,7,10],[94,2,94,5],[108,2,108,5],[8,1,8,2],[8,8,8,9],[9,8,9,9],[10,8,10,9],[11,8,11,9],[80,2,80,5],[12,1,12,2],[12,3,12,6],[38,2,38,5],[44,2,44,5],[72,2,72,5],[51,2,51,5],[52,2,52,5],[53,2,53,5],[58,2,58,5],[11,1,11,2],[12,8,12,9],[13,8,13,9],[14,8,14,9],[20,2,20,5],[21,2,21,5],[22,2,22,5],[28,2,28,5],[29,2,29,5],[8,3,8,6],[9,3,9,6],[9,1,9,2],[10,1,10,2],[10,3,10,6],[45,2,45,5],[46,2,46,5],[143,2,143,5],[81,2,81,5],[88,2,88,5],[73,2,73,5],[74,2,74,5],[60,2,60,5],[65,2,65,5],[66,2,66,5],[67,2,67,5],[138,2,138,5],[59,2,59,5],[87,2,87,5],[96,2,96,5],[103,2,103,5],[30,2,30,5],[36,2,36,5],[37,2,37,5],[254,1,254,7],[167,2,167,9],[131,2,131,5],[117,2,117,5],[124,2,124,5],[226,1,226,9],[227,1,235,1],[249,9,249,10],[123,2,123,5],[129,2,129,5],[192,2,192,5],[248,9,248,10],[194,2,194,5],[145,2,145,5],[250,9,250,10],[223,2,223,9],[224,2,224,9],[195,2,195,5],[187,2,187,5],[183,2,183,9],[179,2,179,9],[180,2,180,9],[181,2,181,9],[182,2,182,9],[238,1,246,1],[222,2,222,9],[152,2,152,5],[157,2,157,5],[178,2,178,6],[173,2,173,5],[185,2,185,5],[186,2,186,5],[193,2,193,5],[227,2,235,10],[172,2,172,5],[237,1,237,10],[200,2,200,5],[201,2,201,5],[202,2,202,5],[207,2,207,5],[208,2,208,5],[209,2,209,5],[158,2,158,5],[159,2,159,5],[238,2,246,10],[214,2,214,6],[215,2,215,9],[216,2,216,9],[171,2,171,5],[164,2,164,6],[150,2,150,5],[151,2,151,5],[95,2,95,5],[102,2,102,5],[110,2,110,5],[116,2,116,5],[136,2,136,5],[137,2,137,5],[115,2,115,5],[101,2,101,5],[109,2,109,5],[130,2,130,5],[144,2,144,5]]}
[null,"Financiële productieverantwoording Jeugdwet",null,null,null,null,null,null,{"$f":"\"Gemeente \"&D9","v":"Gemeente "},null,null,null,null,null,null,null,"wmo",{"$f":"#REF!","v":{"$error":"#REF!"}}]
[null,null,null,null,null,null,null,null,null,null,null,null,null,null,null,null,"jeugd",{"$f":"K223","v":0}]
[]
[null,"In dit onderdeel verantwoordt de zorgaanbieder de geleverde prestaties waarover de zorgaanbieder verantwoording af dient te leggen bij de gemeente: "]
[null,"geleverde prestaties met als grondslag de Jeugdwet. Alle aantallen worden op basis van de werkelijke realisatie ingevuld. "]
[]
[]
[null,"Gemeente ",null,null,null,null,null,null,"Zorgaanbieder"]
[null,"Naam",null,null,null,null,null,null,"Naam",null,{"$f":"Totaalblad!D6","v":0}]
[null,"Plaats",null,null,null,null,null,null,"Plaats",null,{"$f":"Totaalblad!D7","v":0}]
[null,"Contactpersoon",null,null,null,null,null,null,"KvK-nummer",null,{"$f":"Totaalblad!D8","v":0}]
[null,"Telefoon",null,null,null,null,null,null,"Contactpersoon Jeugdwet"]
[null,"E-mail",null,null,null,null,null,null,"Telefoon"]
[null,null,null,null,null,null,null,null,"E-mail"]
[null,null,null,null,null,null,null,null,"AGB-code",null,{"$f":"Totaalblad!D12","v":0}]
[]
[]
[null,"Geleverde prestaties Jeugdwet"]
[null,null,"Inkoop order nr: "]
[]
[null,31,"(2015) Zonder verblijf: uitgevoerd door wijk- of buurtteam",null,null,null,"Code","Eenheid","Aantal (Q)","Prijs in € (P)","Realisatie 2017 in €\n"]
[null,3100,null,null,null,null,null,null,null,null,{"$f":"I22*J22","v":0}]
[null,3101,null,null,null,null,null,null,null,null,{"$f":"I23*J23","v":0}]
[null,3199]
[null,null,"Totaal Zonder verblijf: uitgevoerd door wijk- of buurtteam",null,null,null,null,null,null,null,{"$f":"SUM(K22:K24)","v":0}]
[]
[]
[]
[null,32,"(2015) Zonder verblijf: ambulante jeugdhulp op locatie van de aanbieder",null,null,null,"Code","Eenheid","Aantal (Q)","Prijs in € (P)","Realisatie 2017 in €\n"]
[null,3200,null,null,null,null,null,null,null,null,{"$f":"I30*J30","v":0}]
[null,3201,null,null,null,null,null,null,null,null,{"$f":"I31*J31","v":0}]
[null,3299]
[null,null,"Totaal Zonder verblijf: ambulante jeugdhulp op locatie van de aanbieder",null,null,null,null,null,null,null,{"$f":"SUM(K30:K32)","v":0}]
[]
[]
[]
[null,33,"(2015) Zonder verblijf: daghulp op locatie van de aanbieder",null,null,null,"Code","Eenheid","Aantal (Q)","Prijs in € (P)","Realisatie 2017 in €\n"]
[null,3300,null,null,null,null,null,null,null,null,{"$f":"I38*J38","v":0}]
[null,3301,null,null,null,null,null,null,null,null,{"$f":"I39*J39","v":0}]
[null,3399]
[null,null,"Totaal Zonder verblijf: daghulp op locatie van de aanbieder",null,null,null,null,null,null,null,{"$f":"SUM(K38:K40)","v":0}]
[]
[]
[]
[null,34,"(2015) Zonder verblijf: jeugdhulp in het netwerk van de jeugdige",null,null,null,"Code","Eenheid","Aantal (Q)","Prijs in € (P)","Realisatie 2017 in €\n"]
[null,3400,null,null,null,null,null,null,null,null,{"$f":"I46*J46","v":0}]
[null,3401,null,null,null,null,null,null,null,null,{"$f":"I47*J47","v":0}]
[null,3499]
[null,null,"Totaal Zonder verblijf: jeugdhulp in het netwerk van de jeugdige",null,null,null,null,null,null,null,{"$f":"SUM(K46:K48)","v":0}]
[]
[]
[null,35,"(2015) Met verblijf: pleegzorg",null,null,null,"Code","Eenheid","Aantal (Q)","Prijs in € (P)","Realisatie 2017 in €\n"]
[null,3500,null,null,null,null,null,null,null,null,{"$f":"I53*J53","v":0}]
[null,3501,null,null,null,null,null,null,null,null,{"$f":"I54*J54","v":0}]
[null,3599]
[null,null,"Totaal Met verblijf: pleegzorg",null,null,null,null,null,null,null,{"$f":"SUM(K53:K55)","v":0}]
[]
[]
[null,36,"(2015) Met verblijf: gezinsgericht",null,null,null,"Code","Eenheid","Aantal (Q)","Prijs in € (P)","Realisatie 2017 in €\n"]
[null,3600,null,null,null,null,null,null,null,null,{"$f":"I60*J60","v":0}]
{"$rows_left_out":196}
{"sheet":"einde","index":6,"n_rows":0,"n_cols":0,"rows_kept":0,"cut":false,"hidden":true,"merged":[]}

{"sheet":"Productcodes","index":7,"n_rows":706,"n_cols":3,"rows_kept":706,"cut":false,"hidden":false,"merged":[]}
["IJW 2.0","JZ021 - PRODUCTCODE","CODE"]
["Versie","2017-04-01"]
[null,"Betekenis","code"]
[40,"Persoonlijke verzorging"]
[null,"Persoonlijke verzorging specialistisch: outputgericht","40A01"]
[null,"Persoonlijke verzorging regulier: outputgericht","40A02"]
[null,"Persoonlijke verzorging specialistisch: inspanningsgericht","40A03"]
[null,"Persoonlijke verzorging regulier: inspanningsgericht","40A04"]
[null,"Persoonlijke verzorging regulier: outputgericht (licht)","40A05"]
[null,"Persoonlijke verzorging regulier: outputgericht (middel)","40A06"]
[null,"Persoonlijke verzorging regulier: outputgericht (zwaar)","40A07"]
[null,"Persoonlijke verzorging specialistisch: outputgericht (licht)","40A08"]
[null,"Persoonlijke verzorging specialistisch: outputgericht (middel)","40A09"]
[null,"Persoonlijke verzorging specialistisch: outputgericht (zwaar)","40A10"]
[null,"Persoonlijke verzorging regulier: inspanningsgericht (individueel)","40A11"]
[null,"Persoonlijke verzorging regulier: inspanningsgericht (op afstand)","40A12"]
[null,"Persoonlijke verzorging specialistisch: inspanningsgericht (individueel)","40A13"]
[null,"Persoonlijke verzorging specialistisch: inspanningsgericht (op afstand)","40A14"]
[null,"Persoonlijke verzorging laag tarief: inspanningsgericht","40A15"]
[41,"Dagbehandeling"]
[null,"Dagbehandeling regulier: outputgericht","41A01"]
[null,"Dagbehandeling specialistisch: outputgericht","41A02"]
[null,"Dagbehandeling regulier: inspanningsgericht","41A03"]
[null,"Dagbehandeling specialistisch: inspanningsgericht","41A04"]
[null,"Dagbehandeling regulier: outputgericht (licht)","41A05"]
[null,"Dagbehandeling regulier: outputgericht (middel)","41A06"]
[null,"Dagbehandeling regulier: outputgericht (zwaar)","41A07"]
[null,"Dagbehandeling specialistisch: outputgericht (licht)","41A08"]
[null,"Dagbehandeling specialistisch: outputgericht (middel)","41A09"]
[null,"Dagbehandeling specialistisch: outputgericht (zwaar)","41A10"]
[null,"Dagbehandeling regulier: inspanningsgericht (licht)","41A11"]
[null,"Dagbehandeling regulier: inspanningsgericht (middel)","41A12"]
[null,"Dagbehandeling regulier: inspanningsgericht (zwaar)","41A13"]
[null,"Dagbehandeling specialistisch: inspanningsgericht (licht)","41A14"]
[null,"Dagbehandeling specialistisch: inspanningsgericht (middel)","41A15"]
[null,"Dagbehandeling specialistisch: inspanningsgericht (zwaar)","41A16"]
[null,"Dagbesteding: outputgericht","41A17"]
[null,"Dagbesteding: inspanningsgericht","41A18"]
[null,"Dagbesteding: outputgericht (licht)","41A19"]
[null,"Dagbesteding: outputgericht (middel)","41A20"]
[null,"Dagbesteding: outputgericht (zwaar)","41A21"]
[null,"Dagbesteding: inspanningsgericht (licht)","41A22"]
[null,"Dagbesteding: inspanningsgericht (middel)","41A23"]
[null,"Dagbesteding: inspanningsgericht (zwaar)","41A24"]
[null,"Dagbehandeling: outputgericht","41B00"]
[null,"Diagnostiek op eigen locatie aanbieder: outputgericht","41B01"]
[null,"Diagnostiek op locatie bij andere organisaties: outputgericht","41B02"]
[null,"Begeleiden op eigen locatie aanbieder: outputgericht","41B03"]
[null,"Begeleiden op locatie bij andere organisatie: outputgericht","41B04"]
[null,"Behandelen op eigen locatie aanbieder: outputgericht","41B05"]
[null,"Behandelen op locatie bij andere organisatie: outputgericht","41B06"]
[42,"Vervoerdiensten"]
[null,"Vervoer: outputgericht","42A01"]
[null,"Vervoer rolstoel: outputgericht","42A02"]
[null,"Vervoer: inspanningsgericht","42A03"]
[null,"Vervoer rolstoel: inspanningsgericht","42A04"]
[null,"Vervoer: outputgericht (licht)","42A05"]
[null,"Vervoer: outputgericht (middel)","42A06"]
[null,"Vervoer: outputgericht (zwaar)","42A07"]
[null,"Vervoer rolstoel: outputgericht (licht)","42A08"]
{"$rows_left_out":647}
{"sheet":"sheet_name_check","index":8,"n_rows":0,"n_cols":0,"rows_kept":0,"cut":false,"hidden":true,"merged":[]}